{"text_format":"1","workbook":"xlsx","n_sheets":4,"sheets":["Instructions","FIll ACR","Board Result","Sheet1"],"not_rendered":{"charts":0,"images":1,"macros":1,"external_links":2,"defined_names":35,"comments":0,"pivot_tables":0},"unopened":[],"bounds":{"document_bytes":16777216,"sheet_cells":100000,"rows_first":2000,"rows_last":500,"rows_between":2000,"halvings":0,"cell_chars":16384,"cell_head_chars":4096},"cells_cut":0,"cells_raw":0,"read":"whole","date_system":"1900"}

{"sheet":"Instructions","index":0,"n_rows":12,"n_cols":2,"rows_kept":12,"cut":false,"hidden":false,"merged":[[0,0,0,1]]}
["ey.sI.Awr Brn leI jrrI hdwieqW"]
[1,"quhwfy kMipaUtr qy AnmolilpI PONt hoxw cwhIdw hY (USE Anmolipi Font)"]
[2,"AyYksl 2010 jW ies qoN aupr dw AwiPs dI vrqoN krO"]
[3,"PwieL Kulx qy Enabed Content And Enable Editing btn jo aupr tUlbwr dy hyTw nzr Awvygw aus nUM kil`k krO qW hI shI Awautpu`t AwvygI . jy Aijhw krn qoN rih igAw qW Pweil nUM dubwrw bMd krky aupn kro"]
[4,"qsI Fill ACR sIt qy  kil`k krky auQy isrP pIly Kwny hI Brny hn"]
[5,"Awpxw fwtw iP`l krn qo bwAd iesy swPt kwpI Pwiel qy mu`KI qo nMbr lgvw skdy ho"]
[6,"lwst ivc qusI pIfI.AYP dy rUp ivc syv kr skdy ho"]
[7,"ipRMt k`Fx leI hryk puj leI pyj vwiej rwiet swief btn idqy hn (qW jo pyj dy A`gy ipCy ipMRt k`Fy jw skx_"]
[8,"qusI iksy qrW dy suJwA Aqy PIfbYk leI eImyl AweI. abhi072011@gmail.com qy spMrk kr skdy ho"]
[7,"iesy qrW dy hor swPtvyAr Pwrm Aid pRwpq krn leI swfI vYbswiet nUM ivijt kro "]
[8,"Subscribe Our Youtube Channel for Details Video"]
[9,"Follow Us On Facebook"]

{"sheet":"FIll ACR","index":1,"n_rows":159,"n_cols":17,"rows_kept":159,"cut":false,"hidden":false,"merged":[[88,4,88,11],[89,4,89,11],[90,4,90,11],[86,13,90,13],[86,14,90,14],[86,3,90,3],[92,3,97,3],[75,4,75,11],[76,4,76,11],[77,4,77,11],[78,4,78,11],[79,4,79,11],[80,4,80,11],[81,4,81,11],[75,14,82,14],[75,3,82,3],[75,13,82,13],[83,4,83,11],[84,4,84,11],[85,4,85,11],[83,3,85,3],[83,13,85,13],[83,14,85,14],[86,4,86,11],[87,4,87,11],[130,4,130,11],[121,3,124,3],[137,3,137,14],[139,3,139,11],[139,12,139,13],[140,3,140,13],[141,12,141,13],[142,3,142,14],[141,7,141,11],[136,4,136,13],[133,4,133,11],[134,4,134,11],[135,4,135,11],[121,13,124,13],[121,14,124,14],[99,3,100,3],[105,3,107,3],[105,13,107,13],[105,14,107,14],[109,13,110,13],[109,14,110,14],[109,3,110,3],[111,13,116,13],[72,4,72,11],[73,4,73,11],[49,4,49,14],[50,13,50,14],[51,13,51,14],[52,4,52,14],[41,4,41,9],[41,12,44,14],[42,4,42,8],[43,5,43,8],[69,13,74,13],[69,14,74,14],[63,14,68,14],[68,4,68,11],[63,13,68,13],[15,4,15,9],[15,10,15,14],[36,4,36,9],[57,3,60,3],[18,4,18,9],[26,14,31,14],[31,5,31,8],[59,4,59,11],[60,4,60,11],[16,4,16,9],[16,10,16,14],[17,4,17,9],[57,13,60,13],[57,14,60,14],[17,10,17,14],[51,4,51,12],[58,4,58,11],[18,10,18,14],[22,4,22,14],[23,4,23,14],[19,4,19,9],[19,10,19,14],[20,4,20,8],[32,10,32,14],[4,10,4,14],[5,10,5,11],[12,4,12,6],[12,7,12,9],[10,10,10,11],[10,12,10,14],[9,10,9,11],[9,12,9,14],[6,4,6,9],[6,10,6,14],[7,4,7,9],[7,10,7,14],[8,4,8,9],[5,12,5,14],[8,10,8,14],[10,4,10,6],[10,7,10,9],[12,10,12,11],[12,12,12,14],[11,4,11,9],[11,10,11,14],[0,3,0,14],[1,3,1,14],[2,3,2,9],[2,10,2,11],[2,12,2,14],[145,3,157,3],[146,4,147,7],[146,9,146,14],[147,9,147,14],[150,4,151,7],[150,9,150,14],[151,9,151,14],[154,4,155,7],[154,9,154,14],[155,9,155,14],[157,4,157,14],[144,4,144,14],[9,4,9,6],[9,7,9,9],[5,4,5,5],[5,6,5,9],[3,3,3,5],[3,6,3,14],[4,4,4,9],[13,4,13,9],[13,10,13,14],[14,4,14,9],[55,3,55,14],[44,5,44,8],[74,4,74,11],[82,4,82,11],[56,4,56,11],[69,4,69,11],[67,4,67,11],[14,10,14,14],[36,12,40,14],[37,3,40,3],[37,4,37,8],[38,4,38,8],[50,4,50,12],[54,3,54,14],[63,4,63,11],[64,4,64,11],[65,4,65,11],[66,4,66,11],[61,4,61,11],[46,4,46,14],[57,4,57,11],[33,4,33,7],[33,9,33,14],[34,3,34,8],[70,4,70,11],[92,13,97,13],[99,13,100,13],[99,14,100,14],[101,3,104,3],[101,13,104,13],[101,14,104,14],[91,4,91,11],[92,4,92,11],[93,4,93,11],[94,4,94,11],[95,4,95,11],[96,4,96,11],[97,4,97,11],[99,4,99,11],[100,4,100,11],[101,4,101,11],[102,4,102,11],[103,4,103,11],[104,4,104,11],[71,4,71,11],[117,3,120,3],[117,4,117,11],[111,14,116,14],[111,3,116,3],[105,4,105,11],[106,4,106,11],[107,4,107,11],[108,4,108,11],[109,4,109,11],[110,4,110,11],[111,4,111,11],[112,4,112,11],[113,4,113,11],[114,4,114,11],[115,4,115,11],[116,4,116,11],[92,14,98,14],[61,14,62,14],[117,13,120,13],[117,14,120,14],[125,13,127,13],[125,14,127,14],[125,3,127,3],[130,3,133,3],[130,13,133,13],[130,14,133,14],[118,4,118,11],[119,4,119,11],[120,4,120,11],[121,4,121,11],[122,4,122,11],[123,4,123,11],[124,4,124,11],[125,4,125,11],[131,4,131,11],[132,4,132,11],[126,4,126,11],[127,4,127,11],[128,4,128,11],[129,4,129,11]]}
[null,null,null,"srIrk is`iKAw lYkcrwr/AiDAwpk  dI slwnw mulWkx irport \n(ey.sI.Awr.-7)"]
[null,null,null,"swl : 2022-23"]
[null,null,null,"Bwg - a   mu~FlI jwxkwrI",null,null,null,null,null,null,"XU fweIs kof :  "]
[null,null,null,"skUl dw nW Aqy ijlHw :  "]
[null,null,null,1,"AiDAwpk/AiDAwpkw dw nW"]
[null,null,null,2,"Ahudw",null,null,null,null,null,"E-Punjab ID No. :"]
[null,null,null,3,"ipqw dw nW"]
[null,null,null,4,"ilMg (iesqrI / purS)"]
[null,null,null,5,"jnm imqI"]
[null,null,null,6,"ADwr kwrf nMbr",null,null,null,null,null,"pYn nM:"]
[null,null,null,7,"spMrk nMbr :   mobwiel nM:",null,null,null,null,null,"eI.myl AweI.fI."]
[null,null,null,8,"mu~FlI qnKwh / gRyf py"]
[null,null,null,9,"sInIAwrqw nMbr",null,null,null,null,null,"jI.pI.AYP.nM:/prwn"]
[null,null,null,10,"syvw kwfr (styt/ijlHw/jW hor)"]
[null,null,null,11,"is~iKAw ivBwg iv~c hwzr hox dI imqI"]
[null,null,null,12,"mOjUdw kwfr qy hwzr hox dI imqI"]
[null,null,null,13,"mOjUdw stySn qy hwzr hox dI imqI"]
[null,null,null,14,"syvw mukq hox dI imqI"]
[null,null,null,15,"ividAk Xogqw"]
[null,null,null,16,"irport krn vwly AiDkwrI ADIn syvw krn dw smW kwl"]
[null,null,null,17,"AiDAwpk v~loN kYlMfr swl iv`c leIAW Cu~tIAW: ",null,null,null,null,"ieq: Cu~tI",null,"mYfIkl",0,"kmweI",0]
[null,null,null,"               Bwg -A  (pRI-mulMkx SIt)"]
[null,null,null,"1.","AiDAwpk duAwrw sbMDq swl dOrwn inBweIAW ivSyS syvwvW dw sMKyp vrxn :"]
[]
[null,null,null,"2.","AiDAwpk dy nqIjy"]
["Class3","class2",null,null,"lVIN nM:","jmwq","pVwieAw \nivSw","iemiqhwn iv~c bYTy ivid: dI igxqI","pws ivid: dI igxqI","pws \n %","borf dI pws %","vwDw / Gwtw","60 % qoN v~D AMk pRwpq ivid:","75 % qoN v~D AMk pRwpq ivid:","Bwg e Anuswr gxnW kIqy 200 iv~coN AMk",null,"Total"]
[{"$f":"B27&1","v":{"$error":"#REF!"}},{"$f":"VLOOKUP(C27,#REF!,2,FALSE)","v":{"$error":"#REF!"}},null,null,1,null,null,null,null,{"$f":"IFERROR(ROUND((I27/H27)*100,2),\"\")","v":""},null,{"$f":"IF(J27=\"\",\"\",J27-K27)","v":""},null,null,{"$f":"IFERROR(Q27+Q28+Q29+Q30,0)","v":0},null,{"$f":"ROUND(IF(J32>K32,140,((J32/K32)*140)),0)","v":{"$error":"#DIV/0!"}}]
[{"$f":"B28&1","v":{"$error":"#REF!"}},{"$f":"VLOOKUP(C28,#REF!,2,FALSE)","v":{"$error":"#REF!"}},null,null,2,null,null,null,null,{"$f":"IFERROR(ROUND((I28/H28)*100,2),\"\")","v":""},null,{"$f":"IF(J28=\"\",\"\",J28-K28)","v":""},null,null,null,null,{"$f":"IF(J32=100,20,ROUND(IF(J32>K32,(L32*20)/(100-K32),0),0))","v":0}]
[{"$error":"#REF!"},{"$f":"VLOOKUP(C29,#REF!,2,FALSE)","v":{"$error":"#REF!"}},null,null,3,null,null,null,null,"",null,{"$f":"IF(J29=\"\",\"\",J29-K29)","v":""},null,null,null,null,{"$f":"IF((M32)>20,20,(M32))","v":0}]
[{"$error":"#REF!"},{"$f":"VLOOKUP(C30,#REF!,2,FALSE)","v":{"$error":"#REF!"}},null,null,4,{"$f":"IFERROR(VLOOKUP(C30,#REF!,3,FALSE),\"\")","v":""},null,null,null,"",null,{"$f":"IF(J30=\"\",\"\",J30-K30)","v":""},null,null,null,null,{"$f":"IF((N32)>10,20,(N32*2))","v":0}]
[{"$error":"#REF!"},{"$f":"VLOOKUP(C31,#REF!,2,FALSE)","v":{"$error":"#REF!"}},null,null,5,{"$f":"IFERROR(VLOOKUP(C31,#REF!,3,FALSE),\"\")","v":""},null,null,null,"",null,{"$f":"IF(J31=\"\",\"\",J31-K31)","v":""}]
[null,null,null,null,null,"ku~l/AOsq pRqISq",null,null,null,{"$f":"IFERROR(AVERAGE(J27:J31),0)","v":0},{"$f":"IFERROR(AVERAGE(K27:K31),0)","v":0},{"$f":"IFERROR(AVERAGE(L27:L31),0)","v":0},{"$f":"IFERROR(ROUND(AVERAGE(M27:M31),0),0)","v":0},{"$f":"IFERROR(ROUND(AVERAGE(N27:N31),0),0)","v":0}]
[null,null,null,null,null,null,null,null,null,null,"……………………………"]
[null,null,null,null,null,null,null,null,null,"AiDAwpk dy hsqwKr"]
[null,null,null,"Bwg e : AiDAwpk dI mulWkx dI ivDI:",null,null,null,null,null,"ku~l AMk =200"]
[]
[null,null,null,1,"borf dy nqIjy dy brwbr nqIjw Awaux qy pRwpq AMk",null,null,null,null,null,"…..140 AMk",null,{"$f":"\" ies Bwg dy pRwpq AMk = \" & Q27","v":{"$error":"#DIV/0!"}}]
[null,null,null,2,"jykr nqIjw borf dI pws pRqISqqw qoN G~t hY :"]
[null,null,null,null,"nqIjw cwrt iv~c ivid: dI pws pRqISqw",null,null,null,null,null,"…..a"]
[null,null,null,null,"borf dI Aosq pws pRqISqw",null,null,null,null,null,"…..A"]
[null,null,null,null,"AiDAwpk nUM imlx vwly AMk (140 AMkW iv~coN)",null,null,null,null,null,"…..140  X a/A"]
[null,null,null,3,"jykr nqIjw borf dI pws pRqISqqw qoN v~D hY qW :",null,null,null,null,null,"……..20 AMk",null,{"$f":"\" ies Bwg dy pRwpq AMk = \" & Q28","v":" ies Bwg dy pRwpq AMk = 0"}]
[null,null,null,null,"20 AMkW iv~coN AMk dyx dw sUqr :"]
[null,null,null,null,null,"AiDAwpk dI borf dI pws % qoN v~D nqIjw X 20"]
[null,null,null,null,null,"100-bofr dw AOsq nqIjw",null,null,null,"(100 % nqIjy leI = 160 AMk)"]
[]
[null,null,null,null,"(AiDAwpk kol borf dI jmwq nw hox dI sUrq iv~c CyvIN Aqy s~qvIN dy slwnw nqIijAW dy A~TvIN sRyxI dy ivBwg dy nqIijAW nwl, nOvIN dy nqIijAW dI dsvIN dy pMjwb skUL is~iKAw bofr dy nqIijAW nwl Aqy 11vIN SRyxI dI, 12vIN SRyxI dy pMjwb skUl is`~iKAw boorf dy nqIijAW nwl qulxw kIqI jwvy [)"]
[]
[null,null,null,4,{"$f":"\"guxwqmk is~iKAw leI pRwpq AMk  \"&P29+P30","v":"guxwqmk is~iKAw leI pRwpq AMk  0"},null,null,null,"……ku~l AMk =40"]
[null,null,null,null,"not : borf dIAw ijAwdw jmwqW hox qy AOsq k~F leI jwvy["]
[null,null,null,null,"sbMDq ivSy iv~c 60% AMkW qoN ijAwdw lYx vwly hryk ivid: leI ie~k AMk Aqy v~D qoN v~D 20 AMk id~qy jw skdy hn[",null,null,null,null,null,null,null,null,{"$f":"\"pRwpq AMk = \" & Q29","v":"pRwpq AMk = 0"}]
[null,null,null,null,"sbMDq ivSy iv~c 75 % AMkW qoN ijAwdw lYx vwly hryk ivid: leI do AMk Aqy v~D qoN v~D 20 AMk id~qy jw skdy hn[",null,null,null,null,null,null,null,null,{"$f":"\"pRwpq AMk = \" & Q30","v":"pRwpq AMk = 0"}]
[null,null,null,null,"not : 10 qoN G~t ivid: hox qy swry ivid: dy 75 % qoN v~D AMk hox qy 40 AMk id~qy jw skdy hn["]
[]
[null,null,null,"not : jykr AiDAwpk Bwg-e dy ku~l AMkW dw 40% AMk pRwpq krdw hY qW hI Akwdimk Aqy sih-Akwdimk gqIivDIAW dy \n      pRwpq kIqy Amk joVy jwxgy["]
[null,null,null,"Bwg s. irport krn vwly AiDkwrI v~loN mulWkx"]
[null,null,null,"lVI nM:","Akwdimk Aqy sihAkwdimk gqIivDIAW",null,null,null,null,null,null,null,"ku~l AMk","v~D qoN v~D kul AMk","pRwpq AMk"]
[null,null,null,1,"AiDAwpk v~loN skUl iv`c b~icAW dI igxqI iv~c vwDw krn leI kIqy auprwly",null,null,null,null,null,null,null,null,20]
[null,null,null,null,"pRweIvyt skUl iv`coN G~to G`t do ividAwrQI srkwrI skUL iv`c dwKl krvwaux qy\"",null,null,null,null,null,null,null,10]
[null,null,null,null,"skUl iv`c G~to-G~t 5 ividAwrQI dwKl krvwaux qy",null,null,null,null,null,null,null,10]
[null,null,null,null,"\"AiDAwpk duAwrw pVHwey jw rhy ividAwrQIAW dI igxqI iv~c G~to G~t 2 % dw vwDw krn qy",null,null,null,null,null,null,null,10]
[null,null,null,2,"AiDAwpk dy Awpxy b~cy srkwrI skUl iv`c pVHdy hox qy (pRI pRweImrI qoNN bwrvIN q~k) \nnot : \n(a) ijnHW AiDAwpkW dI sMqwn nhIN  hY jW Ajy kuAwry/kuAwrIAW hn, auhnW AiDAwpkW nUM 10 nMbr Alwt kIqy jwx [\n(A) ijnHW AiDAwpkW dy b~cy 10+2 q~k is~iKAw pRwpq krn dI aumr lMG cu~ky hn, auhnW AiDAwpkW nuM vI 10 nMbr Alwt kIqy jwx [ ",null,null,null,null,null,null,null,10,10]
[]
[null,null,null,3,"AiDAwpn kwrz",null,null,null,null,null,null,null,"",15]
[null,null,null,"","inrMqr Aqy imqI b~D kwpIAW dI jWc",null,null,null,null,null,null,null,4]
[null,null,null,"","ivSy nwl sbMDq pRYktIkl PweIlW iv`c suMdr Aqy AwkrSk ic~qr bxwaux leI kIqy auprwilAW leI",null,null,null,null,null,null,null,3]
[null,null,null,"","AiDAwpk fwierI",null,null,null,null,null,null,null,4]
[null,null,null,"","svyr dI sBw iv`c BwSx (mhINny iv`c G~to-G~t do vwrI)",null,null,null,null,null,null,null,4]
[null,null,null,"","AiDAwpk v~loN klws tYst lYx Aqy irkwrf myntyn krn qy (mhINny iv`c G~to-G~t do vwrI",null,null,null,null,null,null,null,15]
[null,null,null,4,"svyr dI sBw",null,null,null,null,null,null,null,"",20]
[null,null,null,"","pRBwv pUrn qrIky nwl svyr dI sBw krvwaux qy",null,null,null,null,null,null,null,4]
[null,null,null,"","imaUjIkl swjW dI vrqoN krn qy (frMm bIt, hrmonIAm, qblw, lwaUf spIkr Awid)",null,null,null,null,null,null,null,4]
[null,null,null,"","pRBwv pUrn qrIky nwl pI.tI. Krvwaux qy",null,null,null,null,null,null,null,4]
[null,null,null,"","rozwnw hwaUs PlYg lihrwaux qy",null,null,null,null,null,null,null,4]
[null,null,null,"","svyr dI sBw iv`c ividAwrQIAW dy Awaux qy jwx iv`c AnuSwsn kwiem r~Kx qy",null,null,null,null,null,null,null,4]
[null,null,null,5,"KyfW iv`c pRpqIAW",null,null,null,null,null,null,null,null,30]
[null,null,null,null,"blwk/jon dIAW KyfW iv`c Bwg lYx qy ",null,null,null,null,null,null,null,3]
[null,null,null,null,"blwk/zon  dIAW KyfW ivc pujISn lYx qy (isrP pihlI jW dUjI)",null,null,null,null,null,null,null,5]
[null,null,null,null,"ijlHy dIAW KyfW iv`c Bwg lYx qy",null,null,null,null,null,null,null,5]
[null,null,null,null,"ijlHy dIAW KyfW ivc pujISn lYUx qy (isrP pihlI, dUjI jw qIjI)",null,null,null,null,null,null,null,8]
[null,null,null,null,"AMqr ijlw KyfW iv`c Bwg lYx qy",null,null,null,null,null,null,null,10]
[null,null,null,null,"AMqr ijlw KyfW ivc pujISn lYx qy (isrP pihlI, dUjI jw qIjI)",null,null,null,null,null,null,null,15]
[null,null,null,null,"rwStrI KyfW iv`c Bwg/pujISn lYx qy",null,null,null,null,null,null,null,20]
[null,null,null,6,"srIirk is~iKAw lYkcrwr/AiDAwpk dI AwpxI Kyf iv`c auplbDIAW",null,null,null,null,null,null,null,null,5]
[null,null,null,null,"AiDAwpk dI AwpxI ikhVI Kyf iv`c mhuwrq hY : .............................. aus Kyf iv`c Kud dIAW-auplbdIAW/pRwpqI krn qy (sYSn dOrwn iksy vI tUrnWmYNt iv`c phIlI dUjI jW qIjI pujISn hwsl krn qy)",null,null,null,null,null,null,null,5]
[null,null,null,null,"AwpxI Kyf dy hI iKfwrI iqAwr krn qy Aqy ijlHy p~Dr dy iksy tUrnWmYNt iv~c pRwpqI krn qy -(isrP pihlI jW dUjI pujISn hwsl krn qy)",null,null,null,null,null,null,null,5]
[null,null,null,7,"KyfW dy tUrnWmYNt iv`c ifaUtI nBwaux qy",null,null,null,null,null,null,null,null,5]
[null,null,null,null,"blwk/zon dIAW KyfW iv`c ifaUtI dyx qy",null,null,null,null,null,null,null,1]
[null,null,null,null,"ijlHy dIAW KyfW iv`c ifaUtI dyx qy",null,null,null,null,null,null,null,2]
[null,null,null,null,"AMqr ijlw KyfW iv`c ifaUtI dyx qy",null,null,null,null,null,null,null,3]
[null,null,null,null,"rwStrI KyfW iv`c ifaUtI dyx qy",null,null,null,null,null,null,null,5]
[null,null,null,8,"skUl dI AwpxI bYNf tIm iqAwr krn qy",null,null,null,null,null,null,null,5,5]
[null,null,null,9,"ivSyS ijMmyvwrI/ieMcwrjiSp",null,null,null,null,null,null,null,"",10]
[null,null,null,null,"skwaUt,AYn.sI.sI., AYn.AYs.AYs. ieMcwrz",null,null,null,null,null,null,null,2]
[null,null,null,null,"dwKlw Kwrz ieMcwrz",null,null,null,null,null,null,null,2]
[null,null,null,null,"hwaUs ieMcwrz",null,null,null,null,null,null,null,2]
[null,null,null,null,"imf-fy-mIl ieMcwrz",null,null,null,null,null,null,null,2]
[null,null,null,null,"tweIm tybl ieMcrj",null,null,null,null,null,null,null,2]
[]
[null,null,null,10,"skUl dw grwauNf ivkisq krn leI kIqy auprwly",null,null,null,null,null,null,null,"",5]
[null,null,null,null,"AiDAwpk duAwrw Awpxy XqnW / ividAwrQIAW dy sihXog rwhIN skUl grwauNf/ Kyf -ienPrwstrkcr iqAwr krn Aqy r~K rKwA krn qy",null,null,null,null,null,null,null,5]
[null,null,null,11,"ividAwrQIAW dIAW ivSyS jmwqW/kYNp leI kIqy gey au~dm",null,null,null,null,null,null,null,"",10]
[null,null,null,null,"srdIAW dIAW Cu~tIAW dOrwn ivSyS Kyyf isKlweI kYNp/ jmwqW leI (03 idn q~k)",null,null,null,null,null,null,null,2]
[null,null,null,null,"skUl smyN qoN pihlW jW bwAd Kyf isKlweI krvwaux leI",null,null,null,null,null,null,null,3]
[null,null,null,null,"grmIAW dIAW Cu~tIAW dOrwn smr Kyf kYNp lgwaux leI (7-10 idn)",null,null,null,null,null,null,null,5]
[null,null,null,12,"mltImIfIAW rwhIN/ ieMnovyitv qrIky nwl is~iKAw pRdwn krn leI kIqy audm",null,null,null,null,null,null,null,"",10]
[null,null,null,null,"mltImIfIAW rwhIN KyfW bwry uividAwrQIAW nUM isKlweI dyxw",null,null,null,null,null,null,null,5]
[null,null,null,null,"gqIivDIAW Adwirq is~Kx-isKwaux pRikrIAw Apnwaux qy",null,null,null,null,null,null,null,5]
[null,null,null,13,"ivSy nwl sbMDq v~K v~K idvs mnwauxw",null,null,null,null,null,null,null,5,5]
[null,null,null,14,"skUl dw mYgzIn iqAwr krnw",null,null,null,null,null,null,null,"",5]
[null,null,null,null,"AiDAwpk v~loN skUl dy mYgzIn iqAwr krn iv`c Aqy pRkwiSq krvwaux iv`c sihXog dyx qy",null,null,null,null,null,null,null,5]
[null,null,null,15,"sYSn dOrwn pRsMsw p~qr/Avwrf pRwpq krn qy",null,null,null,null,null,null,null,"",10]
[null,null,null,null,"blwk/ qihsIl p~Dr qy",null,null,null,null,null,null,null,2]
[null,null,null,null,"ijlHw p~Dr qy",null,null,null,null,null,null,null,3]
[null,null,null,null,"styt p~Dr qy",null,null,null,null,null,null,null,5]
[null,null,null,null,"ivBwg dy au~c AiDkwrIAW qoN ivSyS pRsMsw p~qr pRwpq krn qy",null,null,null,null,null,null,null,10]
[null,null,null,null,"nYSnl Avwrf pRwpq krn qy",null,null,null,null,null,null,null,10]
[null,null,null,16,"AiDAwpk dw ividAwrQIAW dy mipAW nwl rwbqw",null,null,null,null,null,null,null,"",5]
[null,null,null,null,"SoSl mIfIAw rwhIN",null,null,null,null,null,null,null,1]
[null,null,null,null,"skUl iv`c mIitMgW rwhIN",null,null,null,null,null,null,null,1]
{"$rows_left_out":40}
{"sheet":"Board Result","index":2,"n_rows":117,"n_cols":6,"rows_kept":117,"cut":false,"hidden":false,"merged":[[0,0,0,4]]}
["gzikp ;e{b f;Zfynk p'ov\npkoQthA gqhfynk, wkou - 2023 (o?r{bo)\n"]
["Sub Code","Subject","Total ","Pass","%age"]
[1,"GENERAL ENGLISH",296709,279625,94.24,"%"]
[2,"GENERAL PUNJABI",296368,294613,99.4,"%"]
[3,"PUNJAB HISTORY AND CULTURE",341,325,95.3,"%"]
[4,"PUNJABI (ELECTIVE)",54197,53452,98.62,"%"]
[5,"HINDI (ELECTIVE)",18757,18403,98.11,"%"]
[6,"ENGLISH (ELECTIVE)",7154,7053,98.58,"%"]
[7,"URDU",176,174,98.86,"%"]
[19,"SANSKRIT",178,177,99.43,"%"]
[25,"HISTORY",144493,143126,99.05,"%"]
[26,"ECONOMICS",48042,47547,98.96,"%"]
[28,"MATHEMATICS",40285,39918,99.08,"%"]
[31,"POLITICAL SCIENCE",94099,92914,98.74,"%"]
[32,"SOCIOLOGY",23044,22807,98.97,"%"]
[33,"PUBLIC ADMINISTRATION",189,184,97.35,"%"]
[35,"RELIGION",3026,2931,96.86,"%"]
[36,"MUSIC (VOCAL)",1622,1573,96.97,"%"]
[37,"MUSIC (INSTRUMENTAL)",371,368,99.19,"%"]
[38,"MUSIC (TABLA)",17,17,100,"%"]
[39,"GURMAT SANGEET",28,27,96.42,"%"]
[40,"DANCE",36,33,91.66,"%"]
[41,"PHILOSOPHY",76,71,93.42,"%"]
[42,"GEOGRAPHY",12105,11926,98.52,"%"]
[43,"DEFENCE STUDIES",44,19,43.18,"%"]
[44,"PSYCHOLOGY",713,711,99.71,"%"]
[45,"HOME SCIENCE",4407,4282,97.16,"%"]
[46,"DRAWING AND PAINTING",9548,9467,99.15,"%"]
[48,"COMMERCIAL ART",1475,1448,98.16,"%"]
[49,"PHYSICAL EDUCATION & SPORTS",161381,159577,98.88,"%"]
[50,"HISTORY & APPRECIATION OF ART",52,39,75,"%"]
[52,"PHYSICS",45504,45306,99.56,"%"]
[53,"CHEMISTRY",45504,45319,99.59,"%"]
[54,"BIOLOGY",21760,21623,99.37,"%"]
[65,"AGRICULTURE",1801,1763,97.89,"%"]
[66,"MODELLING & SCULPTURE",573,560,97.73,"%"]
[72,"COMPUTER APPLICATION",1976,1954,98.88,"%"]
[73,"COMMERCIAL CROPS",385,383,99.48,"%"]
[74,"LANDSCAPING AND FLORICULTURE",385,381,98.96,"%"]
[75,"POST HARVEST TECHNOLOGY & PRESERVATION",385,378,98.18,"%"]
[92,"FOOD PROCESSING",569,530,93.14,"%"]
[93,"PLANT MANAGEMENT",569,563,98.94,"%"]
[94,"FOOD PACKAGING",569,561,98.59,"%"]
[95,"DRESS MAKING",1019,1004,98.52,"%"]
[96,"COMMERCIAL CLOTHING",1019,999,98.03,"%"]
[97,"UNIT MANAGEMENT",1019,999,98.03,"%"]
[98,"FASHIONED KNITWEAR",450,439,97.55,"%"]
[99,"CIRCULAR KNITTING",450,438,97.33,"%"]
[100,"TEXTILE YARN CALCULATIONS & GARMENT MAKING",450,438,97.33,"%"]
[101,"FABRIC STRUCTURE AND DESIGNING",434,427,98.38,"%"]
[102,"TEXTILE TESTING AND DYEING",434,425,97.92,"%"]
[103,"POWER LOOM MECHANICS AND OPERATIONS",434,425,97.92,"%"]
[104,"TEXTILE DESIGNING AND PRINTING - II",502,497,99,"%"]
[105,"TEXTILE TESTING AND FINISHING",502,497,99,"%"]
[106,"TEXTILE DYEING - II",502,495,98.6,"%"]
[107,"ELEMENTS OF ELECTRICAL TECHNOLOGY",1417,1382,97.53,"%"]
[108,"ELECTRICAL DOMESTIC APPLIANCES - II",1417,1400,98.8,"%"]
[109,"MATERIALS & WORKSHOP PRACTICE - II",1417,1389,98.02,"%"]
[110,"DIGITAL ELECTRONICS AND COMMUNICATION",904,890,98.45,"%"]
[111,"TEST AND MEASURING INSTRUMENTS",904,892,98.67,"%"]
[112,"ELECTRONICS DEVICE AND CIRCUITS",904,880,97.34,"%"]
[113,"ENGINEERING DRAWING - II",372,368,98.92,"%"]
[114,"WORKSHOP PRACTICE - II",372,368,98.92,"%"]
[115,"CONSTRUCTION MATERIAL AND ESTIMATE",372,365,98.11,"%"]
[116,"FITTING AND WELDING",1030,1008,97.86,"%"]
[117,"MACHINE TOOL OPERATION",1030,1003,97.37,"%"]
[118,"MECHANICAL DRAWING - II",1030,1011,98.15,"%"]
[122,"WORKSHOP TECHNOLOGY",369,365,98.91,"%"]
[123,"GARAGE PRACTICE AND MANAGEMENT",369,365,98.91,"%"]
[124,"AUTOMOBILE SUSPENSION AND CONTROLS",369,365,98.91,"%"]
[125,"OBJECT ORIENTED PROGRAMMING IN C++",612,602,98.36,"%"]
[126,"DESK TOP PUBLISHING",612,599,97.87,"%"]
[127,"NETWORKING",612,600,98.03,"%"]
[137,"ON THE JOB TRAINING",12318,12256,99.49,"%"]
[138,"GENERAL FOUNDATION COURSE",10,10,100,"%"]
[139,"ENVIRONMENTAL EDUCATION",296709,293276,98.84,"%"]
[141,"BUSINESS STUDIES-II",33595,33482,99.66,"%"]
[142,"ACCOUNTANCY-II",33594,33283,99.07,"%"]
[144,"FUNDAMENTALS OF E-BUSINESS (C)",17488,17434,99.69,"%"]
[146,"COMPUTER SCIENCE",296709,294886,99.38,"%"]
[150,"MEDIA STUDIES",22,22,100,"%"]
[169,"PRINCIPLES & PRACTICES OF INSURANCE - II",275,269,97.81,"%"]
[170,"INSURANCE LEGISLATION - II",275,270,98.18,"%"]
[171,"INSURANCE SALESMANSHIP - II",275,267,97.09,"%"]
[172,"ADVANCED MANAGEMENT-II",710,695,97.88,"%"]
[173,"MARKETING MANAGEMENT - II",710,701,98.73,"%"]
[174,"SALESMANSHIP - II",710,700,98.59,"%"]
[181,"MANAGEMENT - II",520,516,99.23,"%"]
[182,"TECHNOLOGY & E-COMMERCE - II",520,517,99.42,"%"]
[183,"IMPORT MANAGEMENT",520,517,99.42,"%"]
[187,"BOOK KEEPING - II",288,284,98.61,"%"]
[188,"APPLICATION OF MANAGEMENT",288,283,98.26,"%"]
[189,"CO-OPERATIVE MANAGEMENT - II",288,283,98.26,"%"]
[190,"ELEMENTS OF BOOK KEEPING - II",317,315,99.36,"%"]
[191,"PRINCIPLES OF MANAGEMENT - II",317,315,99.36,"%"]
[192,"FUNDAMENTALS OF INCOME TAX - II",317,316,99.68,"%"]
[196,"RETAIL",3318,3303,99.54,"%"]
[197,"AUTOMOBILE",866,861,99.42,"%"]
[198,"HEALTH CARE",7416,7359,99.23,"%"]
[199,"INFORMATION TECHNOLOGY / INFORMATION TECHNOLOGY ENABLED SERVICES",6423,6343,98.75,"%"]
[201,"BEAUTY AND WELLNESS",7640,7591,99.35,"%"]
[202,"TRAVEL AND TOURISM",1043,1032,98.94,"%"]
[203,"PHYSICAL EDUCATION AND SPORTS",649,646,99.53,"%"]
[204,"AGRICULTURE (NSQF)",1974,1949,98.73,"%"]
[206,"APPAREL (NSQF)",2456,2431,98.98,"%"]
[207,"CONSTRUCTION",1783,1757,98.54,"%"]
[208,"PLUMBING",1703,1685,98.94,"%"]
[209,"NATIONAL CADET CORPS",514,437,85.01,"%"]
[210,"WELCOME LIFE",296709,295169,99.48,"%"]
[211,"OFFICE MANAGEMENT-II",1594,1580,99.12,"%"]
[212,"TYPOGRAPHY-II (ENGLISH/PUNJABI)",1594,1574,98.74,"%"]
[213,"ACCOUNTING AND E-COMMERCE",1157,1146,99.04,"%"]
[214,"SHORTHAND-II (ENGLISH/PUNJABI)",437,433,99.08,"%"]
[215,"MANAGERIAL ECONOMICS AND STATISTICS",552,545,98.73,"%"]
[216,"ADVANCES AND FOREIGN EXCHANGE",552,544,98.55,"%"]
[217,"INTRODUCTION TO COMPUTER APPLICATIONS",552,544,98.55,"%"]
[218,"POWER",193,189,97.92,"%"]

{"sheet":"Sheet1","index":3,"n_rows":9,"n_cols":1,"rows_kept":9,"cut":false,"hidden":true,"merged":[]}
[]
["Class P"]
["ਛੇਵੀਂ"]
["ਸੱਤਵੀਂ"]
["ਅੱਠਵੀਂ"]
["ਨੌਵੀਂ"]
["ਦਸਵੀਂ"]
["10+1 "]
["10+2"]